BDBM50116131 CHEMBL66782::N-(3-Methoxy-4-oxazol-5-yl-phenyl)-6-phenyl-[1,3,5]triazine-2,4-diamine
SMILES COc1cc(Nc2nc(N)nc(n2)-c2ccccc2)ccc1-c1cnco1
InChI Key InChIKey=CMBCCZAWOWOXBW-UHFFFAOYSA-N
Data  2 IC50
  Tab Delimited (TSV)   2D SDfile   Computed 3D by Vconf -m prep SDfile
Find this compound or compounds like it in BindingDB:
Activity Spreadsheet -- Enzyme Inhibition Constant Data from BindingDB
Found 2 hits for monomerid = 50116131
TargetInosine-5'-monophosphate dehydrogenase 2(Homo sapiens (Human))
Monash University Malaysia
Curated by ChEMBL
LigandPNGBDBM50116131(CHEMBL66782 | N-(3-Methoxy-4-oxazol-5-yl-phenyl)-6...)
Affinity DataIC50:  54nM. Assay description: Inhibition of IMPDH2 (unknown origin)
In DepthDetails PubMed
TargetInosine-5'-monophosphate dehydrogenase 2(Homo sapiens (Human))
Monash University Malaysia
Curated by ChEMBL
LigandPNGBDBM50116131(CHEMBL66782 | N-(3-Methoxy-4-oxazol-5-yl-phenyl)-6...)
Affinity DataIC50:  54nM. Assay description: Inhibition of human Inosine-5'-monophosphate dehydrogenase 2
In DepthDetails ArticlePubMed