BDBM50116149 3-[4-(3-Methoxy-4-oxazol-5-yl-phenylamino)-6-phenyl-[1,3,5]triazin-2-ylamino]-propionic acid::CHEMBL304521
SMILES COc1cc(Nc2nc(NCCC(O)=O)nc(n2)-c2ccccc2)ccc1-c1cnco1
InChI Key InChIKey=HSTLHBRASAJDIA-UHFFFAOYSA-N
Data  1 IC50
  Tab Delimited (TSV)   2D SDfile   Computed 3D by Vconf -m prep SDfile
Find this compound or compounds like it in BindingDB:
Activity Spreadsheet -- Enzyme Inhibition Constant Data from BindingDB
Found 1 hit for monomerid = 50116149
TargetInosine-5'-monophosphate dehydrogenase 2(Homo sapiens (Human))
Bristol-Myers Squibb Pharmaceutical Research Institute
Curated by ChEMBL
LigandPNGBDBM50116149(3-[4-(3-Methoxy-4-oxazol-5-yl-phenylamino)-6-pheny...)
Affinity DataIC50:  130nM. Assay description: Inhibition of human Inosine-5'-monophosphate dehydrogenase 2
In DepthDetails ArticlePubMed