BDBM50116614 CHEMBL117626::N-(9-Ethyl-9H-carbazol-3-ylmethyl)-2-pyridin-4-yl-acetamide
SMILES CCn1c2ccccc2c2cc(CNC(=O)Cc3ccncc3)ccc12
InChI Key InChIKey=VMFPRCQHRTWIPD-UHFFFAOYSA-N
Data  1 IC50
  Tab Delimited (TSV)   2D SDfile   Computed 3D by Vconf -m prep SDfile
Find this compound or compounds like it in BindingDB:
Activity Spreadsheet -- Enzyme Inhibition Constant Data from BindingDB
Found 1 hit for monomerid = 50116614
TargetNeuropeptide Y receptor type 5(Homo sapiens (Human))
Astrazeneca
Curated by ChEMBL
LigandPNGBDBM50116614(CHEMBL117626 | N-(9-Ethyl-9H-carbazol-3-ylmethyl)-...)
Affinity DataIC50:  3.40E+3nM. Assay description: Binding affinity to the human Neuropeptide Y receptor Y5 (NPY5)
In DepthDetails ArticlePubMed