BDBM50116733 3,5-Dichloro-N-{(R)-3-(3,4-dichloro-phenyl)-2-[(Z)-methoxyimino]-5-[4-(3-methyl-2-oxo-tetrahydro-pyrimidin-1-yl)-piperidin-1-yl]-pentyl}-N-methyl-benzamide::CHEMBL75598
SMILES CO\N=C(/CN(C)C(=O)c1cc(Cl)cc(Cl)c1)[C@H](CCN1CCC(CC1)N1CCCN(C)C1=O)c1ccc(Cl)c(Cl)c1
InChI Key InChIKey=CWMJXUYOMKBSDT-NSVMSHEGSA-N
Data  3 KI
  Tab Delimited (TSV)   2D SDfile   Computed 3D by Vconf -m prep SDfile
Find this compound or compounds like it in BindingDB:
Activity Spreadsheet -- Enzyme Inhibition Constant Data from BindingDB
Found 3 hits for monomerid = 50116733
TargetSubstance-P receptor(Homo sapiens (Human))
Schering-Plough Research Institute
Curated by ChEMBL
LigandPNGBDBM50116733(3,5-Dichloro-N-{(R)-3-(3,4-dichloro-phenyl)-2-[(Z)...)
Affinity DataKi:  0.400nM. Assay description: Binding affinity against recombinant human tachykinin receptor 1 in CHO cells using [3H]-Sar SP as radioligand
In DepthDetails ArticlePubMed
TargetSubstance-K receptor(Homo sapiens (Human))
Schering-Plough Research Institute
Curated by ChEMBL
LigandPNGBDBM50116733(3,5-Dichloro-N-{(R)-3-(3,4-dichloro-phenyl)-2-[(Z)...)
Affinity DataKi:  0.700nM. Assay description: Binding affinity against recombinant human tachykinin receptor 2 in CHO cells using [3H]-NKA as radioligand
In DepthDetails ArticlePubMed
TargetNeuromedin-K receptor(Homo sapiens (Human))
Schering-Plough Research Institute
Curated by ChEMBL
LigandPNGBDBM50116733(3,5-Dichloro-N-{(R)-3-(3,4-dichloro-phenyl)-2-[(Z)...)
Affinity DataKi:  0.800nM. Assay description: Binding affinity against recombinant human tachykinin receptor 3 in CHO cells using [125I]-[MePhe]-NKB as radioligand
In DepthDetails ArticlePubMed