BDBM50117678 CHEMBL3613794
SMILES Oc1cc(F)ccc1CNc1ncccc1-c1ncccn1
InChI Key InChIKey=YTVDOVJPKJLMHL-UHFFFAOYSA-N
Data  1 Kd
PDB links: 2 PDB IDs match this monomer.
  Tab Delimited (TSV)   2D SDfile   Computed 3D by Vconf -m prep SDfile
Find this compound or compounds like it in BindingDB:
Activity Spreadsheet -- Enzyme Inhibition Constant Data from BindingDB
Found 1 hit for monomerid = 50117678
TargetCaspase-6(Homo sapiens (Human))
University Of Michigan
Curated by ChEMBL
LigandPNGBDBM50117678(CHEMBL3613794)
Affinity DataKd:  470nM. Assay description: Inhibition of Pro-caspase-6 (unknown origin)