BDBM50118096 2,2'-(4,4'-(1,4-phenylenebis(methylene))bis(oxy)bis(4,1-phenylene))bis(2-oxoacetic acid)::CHEMBL129681::{4-[4-(4-Oxalyl-phenoxymethyl)-benzyloxy]-phenyl}-oxo-acetic acid
SMILES OC(=O)C(=O)c1ccc(OCc2ccc(COc3ccc(cc3)C(=O)C(O)=O)cc2)cc1
InChI Key InChIKey=HNHFGJRWYYEILT-UHFFFAOYSA-N
Data  11 IC50
  Tab Delimited (TSV)   2D SDfile   Computed 3D by Vconf -m prep SDfile
Find this compound or compounds like it in BindingDB:
Activity Spreadsheet -- Enzyme Inhibition Constant Data from BindingDB
Found 11 hits for monomerid = 50118096
TargetReceptor-type tyrosine-protein phosphatase C(Homo sapiens (Human))
Brown University
Curated by ChEMBL
LigandPNGBDBM50118096(2,2'-(4,4'-(1,4-phenylenebis(methylene))bis(oxy)bi...)
Affinity DataIC50:  700nM. Assay description: Concentration required for 50% Inhibition of activity against Yersinia Protein-tyrosine phosphatase
In DepthDetails ArticlePubMed
TargetReceptor-type tyrosine-protein phosphatase F(Homo sapiens (Human))
Brown University
Curated by ChEMBL
LigandPNGBDBM50118096(2,2'-(4,4'-(1,4-phenylenebis(methylene))bis(oxy)bi...)
Affinity DataIC50:  2.50E+5nM. Assay description: Concentration required for 50% Inhibition of activity against Protein-tyrosine phosphatase Lar
In DepthDetails ArticlePubMed
TargetTyrosine-protein phosphatase non-receptor type 1(Homo sapiens (Human))
Brown University
Curated by ChEMBL
LigandPNGBDBM50118096(2,2'-(4,4'-(1,4-phenylenebis(methylene))bis(oxy)bi...)
Affinity DataIC50:  2.70E+3nM. Assay description: Concentration required for 50% Inhibition of activity against Protein Tyrosine Phosphatases 1B
In DepthDetails ArticlePubMed
TargetTyrosine-protein phosphatase non-receptor type 1(Homo sapiens (Human))
Brown University
Curated by ChEMBL
LigandPNGBDBM50118096(2,2'-(4,4'-(1,4-phenylenebis(methylene))bis(oxy)bi...)
Affinity DataIC50:  5.73E+3nM. Assay description: Inhibition of PTP1B (unknown origin) by pNPP assay
In DepthDetails ArticlePubMed
TargetTyrosine-protein phosphatase non-receptor type 2(Homo sapiens (Human))
Chinese Academy Of Sciences
Curated by ChEMBL
LigandPNGBDBM50118096(2,2'-(4,4'-(1,4-phenylenebis(methylene))bis(oxy)bi...)
Affinity DataIC50:  5.35E+3nM. Assay description: Inhibition of TCPTP (unknown origin) by pNPP assay
In DepthDetails ArticlePubMed
TargetTyrosine-protein phosphatase non-receptor type 1(Homo sapiens (Human))
Brown University
Curated by ChEMBL
LigandPNGBDBM50118096(2,2'-(4,4'-(1,4-phenylenebis(methylene))bis(oxy)bi...)
Affinity DataIC50:  5.73E+3nM. Assay description: Inhibition of PTP1B (unknown origin)
In DepthDetails Article
TargetTyrosine-protein phosphatase non-receptor type 2(Homo sapiens (Human))
Chinese Academy Of Sciences
Curated by ChEMBL
LigandPNGBDBM50118096(2,2'-(4,4'-(1,4-phenylenebis(methylene))bis(oxy)bi...)
Affinity DataIC50:  6.24E+3nM. Assay description: Inhibition of GST-tagged human TCPTP
In DepthDetails ArticlePubMed
TargetTyrosine-protein phosphatase non-receptor type 2(Homo sapiens (Human))
Chinese Academy Of Sciences
Curated by ChEMBL
LigandPNGBDBM50118096(2,2'-(4,4'-(1,4-phenylenebis(methylene))bis(oxy)bi...)
Affinity DataIC50:  6.24E+3nM. Assay description: Inhibition of TCPTP by para-nitrophenyl phosphate release assay
In DepthDetails ArticlePubMed
TargetTyrosine-protein phosphatase non-receptor type 1(Homo sapiens (Human))
Brown University
Curated by ChEMBL
LigandPNGBDBM50118096(2,2'-(4,4'-(1,4-phenylenebis(methylene))bis(oxy)bi...)
Affinity DataIC50:  3.89E+3nM. Assay description: Inhibition of PTP1B by para-nitrophenyl phosphate release assay
In DepthDetails ArticlePubMed
TargetTyrosine-protein phosphatase non-receptor type 1(Homo sapiens (Human))
Brown University
Curated by ChEMBL
LigandPNGBDBM50118096(2,2'-(4,4'-(1,4-phenylenebis(methylene))bis(oxy)bi...)
Affinity DataIC50:  5.73E+3nM. Assay description: Inhibition of PTP1B (unknown origin)
In DepthDetails Article
TargetTyrosine-protein phosphatase non-receptor type 1(Homo sapiens (Human))
Brown University
Curated by ChEMBL
LigandPNGBDBM50118096(2,2'-(4,4'-(1,4-phenylenebis(methylene))bis(oxy)bi...)
Affinity DataIC50:  3.89E+3nM. Assay description: Inhibition of GST-tagged human PTP 1B
In DepthDetails ArticlePubMed