BDBM50118182 CHEMBL3613165
SMILES CC1(C)C2CCC1(CS(O)(=O)=O)C(=O)C2.[H][C@]12C[C@@]34Cc5ccc(O)cc5[C@@]3(CCN(CC3CC3)[C@@]4([H])C=C1)C[C@H]2N(C)C(=O)Cc1ccccc1
InChI Key InChIKey=MFMBQOYXVBNXQJ-UVLAHWMYSA-N
Data  3 KI
  Tab Delimited (TSV)   2D SDfile   Computed 3D by Vconf -m prep SDfile
Find this compound or compounds like it in BindingDB:
Activity Spreadsheet -- Enzyme Inhibition Constant Data from BindingDB
Found 3 hits for monomerid = 50118182
TargetKappa-type opioid receptor(Mus musculus (Mouse))
University Of Tsukuba
Curated by ChEMBL
LigandPNGBDBM50118182(CHEMBL3613165)
Affinity DataKi:  0.240nM. Assay description: Displacement of [3H]U69,593 from KOR in mouse whole brain membranes without cerebellum
In DepthDetails ArticlePubMed
TargetMu-type opioid receptor(GUINEA PIG)
University Of Tsukuba
Curated by ChEMBL
LigandPNGBDBM50118182(CHEMBL3613165)
Affinity DataKi:  0.420nM. Assay description: Displacement of [3H]DAMGO from MOR in guinea pig cerebellum membranes
In DepthDetails ArticlePubMed
TargetDelta-type opioid receptor(MOUSE)
University Of Tsukuba
Curated by ChEMBL
LigandPNGBDBM50118182(CHEMBL3613165)
Affinity DataKi:  1.70nM. Assay description: Displacement of [3H]DPDPE from DOR in mouse whole brain membranes without cerebellum
In DepthDetails ArticlePubMed