BDBM50119009 (E)-N-(3-Methoxy-4-oxazol-5-yl-phenyl)-3-phenyl-acrylamide::CHEMBL99451
SMILES COc1cc(NC(=O)\C=C\c2ccccc2)ccc1-c1cnco1
InChI Key InChIKey=GOQLBHMOLKQZSB-JXMROGBWSA-N
Data  1 IC50
  Tab Delimited (TSV)   2D SDfile   Computed 3D by Vconf -m prep SDfile
Find this compound or compounds like it in BindingDB:
Activity Spreadsheet -- Enzyme Inhibition Constant Data from BindingDB
Found 1 hit for monomerid = 50119009
TargetInosine-5'-monophosphate dehydrogenase 2(Homo sapiens (Human))
Bristol-Myers Squibb Pri
Curated by ChEMBL
LigandPNGBDBM50119009((E)-N-(3-Methoxy-4-oxazol-5-yl-phenyl)-3-phenyl-ac...)
Affinity DataIC50:  73nM. Assay description: Inhibitory activity of compound was evaluated against the Inosine-5'-monophosphate dehydrogenase 2
In DepthDetails ArticlePubMed