BDBM50119119 CHEMBL98740::N''-cyano-N-[3-methoxy-4-(1,3-oxazol-5-yl)phenyl]-N'-(3-methylphenyl)guanidine
SMILES COc1cc(NC(Nc2cccc(C)c2)=NC#N)ccc1-c1cnco1
InChI Key InChIKey=BHXLCGSRWZLZDB-UHFFFAOYSA-N
Data  1 IC50
  Tab Delimited (TSV)   2D SDfile   Computed 3D by Vconf -m prep SDfile
Find this compound or compounds like it in BindingDB:
Activity Spreadsheet -- Enzyme Inhibition Constant Data from BindingDB
Found 1 hit for monomerid = 50119119
TargetInosine-5'-monophosphate dehydrogenase 2(Homo sapiens (Human))
Bristol-Myers Squibb Pharmaceutical Research Institute
Curated by ChEMBL
LigandPNGBDBM50119119(CHEMBL98740 | N''-cyano-N-[3-methoxy-4-(1,3-oxazol...)
Affinity DataIC50:  240nM. Assay description: In vitro inhibition of Inosine-5'-monophosphate dehydrogenase 2.
In DepthDetails ArticlePubMed