BDBM50119408 24-Benzyl-30-ethyl-33-(1-hydroxy-2-methyl-hept-4-enyl)-6,9,18-triisobutyl-3,21-diisopropyl-1,4,7,10,12,15,19,25,28-nonamethyl-1,4,7,10,13,16,19,22,25,28,31undecaaza-cyclotritriacontan-2,5,8,11,14,17,20,23,26,29,32-undecaone::CID44361041::cyclo-[MeBmt-Abu-MeGly-MePhe-Val-MeLeu-Ala-D-Ala-MeLeu-MeLeu-MeVal]24-Benzyl-30-ethyl-33-(1-hydroxy-2-methyl-hept-4-enyl)-6,9,18-triisobutyl-3,21-diisopropyl-1,4,7,10,12,15,19,25,28-nonamethyl-1,4,7,10,13,16,19,22,25,28,31undecaaza-cyclotritriacontan-2,5,8,11,14,17,20,23,26,29,32-undecaone::cyclosporin analogue 22
SMILES CC\C=C\C[C@@H](C)[C@@H](O)C1N(C)C(=O)[C@H](C(C)C)N(C)C(=O)[C@H](CC(C)C)N(C)C(=O)[C@H](CC(C)C)N(C)C(=O)[C@@H](C)NC(=O)C(C)NC(=O)[C@@H](CC(C)C)N(C)C(=O)[C@H](NC(=O)C(Cc2ccccc2)N(C)C(=O)CN(C)C(=O)C(CC)NC1=O)C(C)C
InChI Key InChIKey=QFBHUTLKESKPGE-ZLCPSZQSSA-N
Data  1 IC50
  Tab Delimited (TSV)   2D SDfile   Computed 3D by Vconf -m prep SDfile
Find this compound or compounds like it in BindingDB:
Activity Spreadsheet -- Enzyme Inhibition Constant Data from BindingDB
Found 1 hit for monomerid = 50119408
TargetATP-dependent translocase ABCB1(Homo sapiens (Human))
Strasbourg 1 University
Curated by ChEMBL
LigandPNGBDBM50119408(24-Benzyl-30-ethyl-33-(1-hydroxy-2-methyl-hept-4-e...)
Affinity DataIC50:  2.40E+3nM. Assay description: Inhibitory activity against Human MDR1 P-Glycoprotein ABC Transporter using leukemia CEM cells
In DepthDetails ArticlePubMed