BDBM501197 US11021493, Example 116
SMILES CN1C(N)=N[C@@](C)(CS1(=O)=O)c1cc(\C=C(/F)c2cnc(OCc3ncco3)cn2)ccc1F
InChI Key InChIKey=LLBSPEOFGKBDBA-NSUHCSJYSA-N
Data  4 IC50
  Tab Delimited (TSV)   2D SDfile   Computed 3D by Vconf -m prep SDfile
Find this compound or compounds like it in BindingDB:
Activity Spreadsheet -- Enzyme Inhibition Constant Data from BindingDB
Found 4 hits for monomerid = 501197
TargetBeta-secretase 1(Homo sapiens (Human))
Amgen
US Patent
LigandPNGBDBM501197(US11021493, Example 116)
Affinity DataIC50:  3nM. Assay description: The cDNAs for both human recombinant BACE1 and 2 with C-terminal 6-His Tags were cloned into transient protein expression vectors, which were subsequ...
Ligand InfoPC cidPC sid
In DepthDetails US Patent
TargetCathepsin D(Homo sapiens (Human))
Amgen
US Patent
LigandPNGBDBM501197(US11021493, Example 116)
Affinity DataIC50:  4.38E+4nM. Assay description: Recombinant CatD was expressed in CHO cells. The assay buffer for CatD was 0.05 M citrate pH 3.5, 10% DMSO final, 5 mM CHAPS. The CatD enzyme (9 nM) ...
Ligand InfoPC cidPC sid
In DepthDetails US Patent
TargetBeta-secretase 2(Homo sapiens (Human))
Amgen
US Patent
LigandPNGBDBM501197(US11021493, Example 116)
Affinity DataIC50:  45nM. Assay description: The cDNAs for both human recombinant BACE1 and 2 with C-terminal 6-His Tags were cloned into transient protein expression vectors, which were subsequ...
Ligand InfoPC cidPC sid
In DepthDetails US Patent
TargetBeta-secretase 1(Homo sapiens (Human))
Amgen
US Patent
LigandPNGBDBM501197(US11021493, Example 116)
Affinity DataIC50:  1nM. Assay description: The cell-based assay measures inhibition or reduction of Aβ40 in conditioned medium of test compound treated cells expressing amyloid precursor ...
Ligand InfoPC cidPC sid
In DepthDetails US Patent