BDBM50120830 CHEMBL599385
SMILES OC(=O)c1cc(Nc2nc(cs2)-c2ccc(O)cc2O)ccc1O
InChI Key InChIKey=MPAYVGVGFSEMRH-UHFFFAOYSA-N
Data  1 IC50
  Tab Delimited (TSV)   2D SDfile   Computed 3D by Vconf -m prep SDfile
Find this compound or compounds like it in BindingDB:
Activity Spreadsheet -- Enzyme Inhibition Constant Data from BindingDB
Found 1 hit for monomerid = 50120830
TargetAlpha-amylase 1A(Homo sapiens (Human))
Freie Universit£T Berlin
Curated by ChEMBL
LigandPNGBDBM50120830(CHEMBL599385)
Affinity DataIC50:  4.23E+5nM. Assay description: Inhibition of human salivary alpha-amylase using GalG2CNP as substrate by UV-Vis spectrophotometric analysis
In DepthDetails ArticlePubMed