BDBM50121398 CHEMBL3616480
SMILES CC[C@H](C)[C@H](NC(=O)[C@H](Cc1ccccc1)NC(=O)[C@H](CCC(O)=O)NC(=O)[C@H](CCCNC(N)=N)NC(=O)[C@H](C)NC(=O)[C@H](C)NC(=O)[C@H](CCC(N)=O)NC(=O)CNC(=O)[C@H](CCC(O)=O)NC(=O)[C@H](CC(C)C)NC(=O)[C@H](Cc1ccc(O)cc1)NC(=O)[C@H](CO)NC(=O)[C@H](CO)NC(=O)[C@@H](NC(=O)[C@H](CC(O)=O)NC(=O)[C@H](CO)NC(=O)[C@@H](NC(=O)[C@H](Cc1ccccc1)NC(=O)[C@@H](NC(=O)CNC(=O)[C@H](CCC(O)=O)NC(=O)C(C)(C)NC(=O)[C@@H](N)Cc1c[nH]cn1)[C@@H](C)O)[C@@H](C)O)C(C)C)C(=O)N[C@@H](C)C(=O)N[C@@H](Cc1c[nH]c2ccccc12)C(=O)N[C@@H](CC(C)C)C(=O)N[C@@H](C(C)C)C(=O)N[C@@H](CCCNC(N)=N)C(=O)NCC(=O)N[C@@H](CCCCNC(=O)COCCOCCNC(=O)COCCOCCNC(=O)CCCCCCCCCCCCCCCCC(O)=O)C(=O)NCC(O)=O
InChI Key InChIKey=BXOZOFYLJAJFKS-SENWUGENSA-N
Data  2 IC50  1 EC50
  Tab Delimited (TSV)   2D SDfile   Computed 3D by Vconf -m prep SDfile
Find this compound or compounds like it in BindingDB:
Activity Spreadsheet -- Enzyme Inhibition Constant Data from BindingDB
Found 3 hits for monomerid = 50121398
TargetGlucagon-like peptide 1 receptor(Homo sapiens (Human))
Novo Nordisk
Curated by ChEMBL
LigandPNGBDBM50121398(CHEMBL3616480)
Affinity DataIC50:  15nM. Assay description: Displacement of [125I]-GLP1 from human GLP1 receptor expressed in BHK cells after 2 hrs in presence of 2% human serum albumin
In DepthDetails ArticlePubMed
TargetGlucagon-like peptide 1 receptor(Homo sapiens (Human))
Novo Nordisk
Curated by ChEMBL
LigandPNGBDBM50121398(CHEMBL3616480)
Affinity DataEC50:  0.00700nM. Assay description: Agonist activity at human GLP1 receptor expressed in BHK cells after 3 hrs by CRE firefly luciferase reporter gene assay in absence of human serum al...
In DepthDetails ArticlePubMed
TargetGlucagon-like peptide 1 receptor(Homo sapiens (Human))
Novo Nordisk
Curated by ChEMBL
LigandPNGBDBM50121398(CHEMBL3616480)
Affinity DataIC50:  0.110nM. Assay description: Displacement of [125I]-GLP1 from human GLP1 receptor expressed in BHK cells after 2 hrs in absence of human serum albumin
In DepthDetails ArticlePubMed