BDBM50122046 3-Methoxy-N-[4-(4-naphthalen-1-yl-piperazin-1-yl)-butyl]-benzamide::CHEMBL152756
SMILES COc1cccc(c1)C(=O)NCCCCN1CCN(CC1)c1cccc2ccccc12
InChI Key InChIKey=CQGCCVPXYLTEHT-UHFFFAOYSA-N
Data  4 KI
  Tab Delimited (TSV)   2D SDfile   Computed 3D by Vconf -m prep SDfile
Find this compound or compounds like it in BindingDB:
Activity Spreadsheet -- Enzyme Inhibition Constant Data from BindingDB
Found 4 hits for monomerid = 50122046
Target5-hydroxytryptamine receptor 1A(Rattus norvegicus (rat))
Universit£
Curated by ChEMBL
LigandPNGBDBM50122046(3-Methoxy-N-[4-(4-naphthalen-1-yl-piperazin-1-yl)-...)
Affinity DataKi:  0.430nM. Assay description: Binding affinity towards 5-hydroxytryptamine 1A receptor from rat hippocampal membranes
In DepthDetails ArticlePubMed
TargetD(3) dopamine receptor(Rattus norvegicus (Rat))
Universit£
Curated by ChEMBL
LigandPNGBDBM50122046(3-Methoxy-N-[4-(4-naphthalen-1-yl-piperazin-1-yl)-...)
Affinity DataKi:  0.540nM. Assay description: Binding affinity towards Dopamine receptor D3 of rat using [3H]spiroperidol as radioligand
In DepthDetails ArticlePubMed
TargetD(4) dopamine receptor(Homo sapiens (Human))
Universit£
Curated by ChEMBL
LigandPNGBDBM50122046(3-Methoxy-N-[4-(4-naphthalen-1-yl-piperazin-1-yl)-...)
Affinity DataKi:  2.30nM. Assay description: Binding affinity towards human Dopamine receptor D4 using [3H]spiroperidol as radioligand
In DepthDetails ArticlePubMed
TargetD(2) dopamine receptor(Homo sapiens (Human))
Universit£
Curated by ChEMBL
LigandPNGBDBM50122046(3-Methoxy-N-[4-(4-naphthalen-1-yl-piperazin-1-yl)-...)
Affinity DataKi:  930nM. Assay description: Binding affinity towards human Dopamine receptor D2 using [3H]spiroperidol as radioligand
In DepthDetails ArticlePubMed