BDBM50123334 2-(4-Hydroxy-phenyl)-7-methoxy-6-oxazol-5-yl-1H-quinolin-4-one::CHEMBL153014
SMILES COc1cc2nc(cc(O)c2cc1-c1cnco1)-c1ccc(O)cc1
InChI Key InChIKey=LAZMBVWHUPTDFC-UHFFFAOYSA-N
Data  1 IC50
  Tab Delimited (TSV)   2D SDfile   Computed 3D by Vconf -m prep SDfile
Find this compound or compounds like it in BindingDB:
Activity Spreadsheet -- Enzyme Inhibition Constant Data from BindingDB
Found 1 hit for monomerid = 50123334
TargetInosine-5'-monophosphate dehydrogenase 2(Homo sapiens (Human))
Bristol-Myers Squibb Pri
Curated by ChEMBL
LigandPNGBDBM50123334(2-(4-Hydroxy-phenyl)-7-methoxy-6-oxazol-5-yl-1H-qu...)
Affinity DataIC50:  43nM. Assay description: Inhibition of human inosine monophosphate dehydrogenase IMPDH II
In DepthDetails ArticlePubMed