BDBM50124174 CHEMBL444608::N-[2-({2-[(aminosulfonyl)amino]ethyl}dithio)ethyl]sulfamide
SMILES NS(=O)(=O)NCCSSCCNS(N)(=O)=O
InChI Key InChIKey=MVZGRUJXBADFPR-UHFFFAOYSA-N
Data  2 KI
  Tab Delimited (TSV)   2D SDfile   Computed 3D by Vconf -m prep SDfile
Find this compound or compounds like it in BindingDB:
Activity Spreadsheet -- Enzyme Inhibition Constant Data from BindingDB
Found 2 hits for monomerid = 50124174
TargetCarbonic anhydrase 2(Homo sapiens (Human))
Universit£
Curated by ChEMBL
LigandPNGBDBM50124174(CHEMBL444608 | N-[2-({2-[(aminosulfonyl)amino]ethy...)
Affinity DataKi:  27nM. Assay description: Inhibitory activity against human cloned isoenzyme carbonic anhydrase II (hCA II), by esterase method.
In DepthDetails ArticlePubMed
TargetCarbonic anhydrase 1(Homo sapiens (Human))
Universit£
Curated by ChEMBL
LigandPNGBDBM50124174(CHEMBL444608 | N-[2-({2-[(aminosulfonyl)amino]ethy...)
Affinity DataKi:  149nM. Assay description: Inhibitory activity against human cloned isoenzyme carbonic anhydrase I (hCA I), by esterase method.
In DepthDetails ArticlePubMed