BDBM50124981 CHEMBL166317::N-[(R)-4-Guanidino-1-(thiazole-2-carbonyl)-butyl]-2-[2-oxo-3-(2-piperidin-4-yl-ethyl)-piperidin-1-yl]-acetamide
SMILES NC(=N)NCCC[C@@H](NC(=O)CN1CCCC(CCC2CCNCC2)C1=O)C(=O)c1nccs1
InChI Key InChIKey=WXOQKHJVZGIOPQ-QRWMCTBCSA-N
Data  2 IC50
  Tab Delimited (TSV)   2D SDfile   Computed 3D by Vconf -m prep SDfile
Find this compound or compounds like it in BindingDB:
Activity Spreadsheet -- Enzyme Inhibition Constant Data from BindingDB
Found 2 hits for monomerid = 50124981
TargetProthrombin(Homo sapiens (Human))
Millennium Pharmaceuticals
Curated by ChEMBL
LigandPNGBDBM50124981(CHEMBL166317 | N-[(R)-4-Guanidino-1-(thiazole-2-ca...)
Affinity DataIC50:  1.20E+4nM. Assay description: In vitro inhibitory activity against serine protease thrombin
In DepthDetails ArticlePubMed
TargetCoagulation factor X(Homo sapiens (Human))
Millennium Pharmaceuticals
Curated by ChEMBL
LigandPNGBDBM50124981(CHEMBL166317 | N-[(R)-4-Guanidino-1-(thiazole-2-ca...)
Affinity DataIC50:  65nM. Assay description: In vitro inhibitory activity against factor Xa
In DepthDetails ArticlePubMed