BDBM50124993 2-[4-(5-Chloro-naphthalene-1-sulfonyl)-2-oxo-piperazin-1-yl]-N-[4-guanidino-1-(thiazole-2-carbonyl)-butyl]-acetamide::CHEMBL349290
SMILES NC(=N)NCCCC(NC(=O)CN1CCN(CC1=O)S(=O)(=O)c1cccc2c(Cl)cccc12)C(=O)c1nccs1
InChI Key InChIKey=WXSMCGMEOQRDFJ-UHFFFAOYSA-N
Data  2 IC50
  Tab Delimited (TSV)   2D SDfile   Computed 3D by Vconf -m prep SDfile
Find this compound or compounds like it in BindingDB:
Activity Spreadsheet -- Enzyme Inhibition Constant Data from BindingDB
Found 2 hits for monomerid = 50124993
TargetProthrombin(Homo sapiens (Human))
Millennium Pharmaceuticals
Curated by ChEMBL
LigandPNGBDBM50124993(2-[4-(5-Chloro-naphthalene-1-sulfonyl)-2-oxo-piper...)
Affinity DataIC50:  185nM. Assay description: In vitro inhibitory activity against serine protease thrombin
In DepthDetails ArticlePubMed
TargetCoagulation factor X(Homo sapiens (Human))
Millennium Pharmaceuticals
Curated by ChEMBL
LigandPNGBDBM50124993(2-[4-(5-Chloro-naphthalene-1-sulfonyl)-2-oxo-piper...)
Affinity DataIC50:  0.620nM. Assay description: In vitro inhibitory activity against factor Xa
In DepthDetails ArticlePubMed