BDBM50126007 2-Benzyl-6-methoxy-5-oxazol-5-yl-1H-indole-3-carbonitrile::CHEMBL23108
SMILES COc1cc2[nH]c(Cc3ccccc3)c(C#N)c2cc1-c1cnco1
InChI Key InChIKey=OMURDLKZQFOTPN-UHFFFAOYSA-N
Data  1 IC50
  Tab Delimited (TSV)   2D SDfile   Computed 3D by Vconf -m prep SDfile
Find this compound or compounds like it in BindingDB:
Activity Spreadsheet -- Enzyme Inhibition Constant Data from BindingDB
Found 1 hit for monomerid = 50126007
TargetInosine-5'-monophosphate dehydrogenase 2(Homo sapiens (Human))
Bristol-Myers Squibb Pri
Curated by ChEMBL
LigandPNGBDBM50126007(2-Benzyl-6-methoxy-5-oxazol-5-yl-1H-indole-3-carbo...)
Affinity DataIC50:  220nM. Assay description: Inhibition of 5'-inosine monophosphate dehydrogenase type II (IMPDH II)
In DepthDetails ArticlePubMed