BDBM50126304 2-{6-Chloro-3-[2,2-difluoro-2-(1-oxy-pyridin-2-yl)-ethylamino]-2-oxo-2H-pyrazin-1-yl}-N-(2,5-dichloro-benzyl)-acetamide::CHEMBL281982
SMILES [O-][n+]1ccccc1C(F)(F)CNc1ncc(Cl)n(CC(=O)NCc2cc(Cl)ccc2Cl)c1=O
InChI Key InChIKey=LAQSIGINZGZCON-UHFFFAOYSA-N
Data  1 KI
  Tab Delimited (TSV)   2D SDfile   Computed 3D by Vconf -m prep SDfile
Find this compound or compounds like it in BindingDB:
Activity Spreadsheet -- Enzyme Inhibition Constant Data from BindingDB
Found 1 hit for monomerid = 50126304
TargetProthrombin(Homo sapiens (Human))
Merck Research Laboratories
Curated by ChEMBL
LigandPNGBDBM50126304(2-{6-Chloro-3-[2,2-difluoro-2-(1-oxy-pyridin-2-yl)...)
Affinity DataKi:  0.0870nM. Assay description: Inhibitory activity against human thrombin
In DepthDetails ArticlePubMed