BDBM50126975 CHEMBL3629589
SMILES Cn1cnc(c1)S(=O)(=O)Nc1cccc(c1)-c1ccc(s1)C(=O)c1c(F)ccc(O)c1F
InChI Key InChIKey=BPWHZPFCTAZPMO-UHFFFAOYSA-N
Data  2 IC50
  Tab Delimited (TSV)   2D SDfile   Computed 3D by Vconf -m prep SDfile
Find this compound or compounds like it in BindingDB:
Activity Spreadsheet -- Enzyme Inhibition Constant Data from BindingDB
Found 2 hits for monomerid = 50126975
Target17-beta-hydroxysteroid dehydrogenase type 1(Homo sapiens (Human))
Saarland University
Curated by ChEMBL
LigandPNGBDBM50126975(CHEMBL3629589)
Affinity DataIC50:  6nM. Assay description: Inhibition of human placental cytosolic 17beta HSD1 using unlabeled- and labelled [2,4,6,7-3H]-E1 as substrate incubated for 10 mins by HPLC analysis
In DepthDetails ArticlePubMed
Target17-beta-hydroxysteroid dehydrogenase type 2(Homo sapiens (Human))
Saarland University
Curated by ChEMBL
LigandPNGBDBM50126975(CHEMBL3629589)
Affinity DataIC50:  2.70nM. Assay description: Inhibition of human placental microsomal 17beta HSD2 using unlabeled- and labelled [2,4,6,7-3H]-E2 as substrate incubated for 20 mins by HPLC analysi...
In DepthDetails ArticlePubMed