BDBM50127780 Benzo[b]thiophene-2-carboxylic acid [2-(2,2,2-trifluoro-1-hydroxy-1-trifluoromethyl-ethyl)-naphthalen-1-yl]-amide::CHEMBL52283
SMILES OC(c1ccc2ccccc2c1NC(=O)c1cc2ccccc2s1)(C(F)(F)F)C(F)(F)F
InChI Key InChIKey=OUWXFDFRZJGRRH-UHFFFAOYSA-N
Data  1 EC50
  Tab Delimited (TSV)   2D SDfile   Computed 3D by Vconf -m prep SDfile
Find this compound or compounds like it in BindingDB:
Activity Spreadsheet -- Enzyme Inhibition Constant Data from BindingDB
Found 1 hit for monomerid = 50127780
TargetATP-sensitive inward rectifier potassium channel 11(Homo sapiens (Human))
Abbott Laboratories
Curated by ChEMBL
LigandPNGBDBM50127780(Benzo[b]thiophene-2-carboxylic acid [2-(2,2,2-trif...)
Affinity DataEC50: >1.00E+4nM. Assay description: Potassium channel opening activity in vitro using LtK cells transfected with Kir6.2/SUR2B exon 17
In DepthDetails ArticlePubMed