BDBM50128469 CHEMBL56663::[(2R,4S)-6-Fluoro-4-(4-fluoro-phenylamino)-2-methyl-3,4-dihydro-2H-quinolin-1-yl]-(4-methoxy-phenyl)-methanone
SMILES COc1ccc(cc1)C(=O)N1[C@H](C)C[C@H](Nc2ccc(F)cc2)c2cc(F)ccc12
InChI Key InChIKey=MIEGTLCGWZYDRN-QRQCRPRQSA-N
Data  1 EC50
  Tab Delimited (TSV)   2D SDfile   Computed 3D by Vconf -m prep SDfile
Find this compound or compounds like it in BindingDB:
Activity Spreadsheet -- Enzyme Inhibition Constant Data from BindingDB
Found 1 hit for monomerid = 50128469
TargetEcdysone receptor(Aedes aegypti)
Rheogene
Curated by ChEMBL
LigandPNGBDBM50128469(CHEMBL56663 | [(2R,4S)-6-Fluoro-4-(4-fluoro-phenyl...)
Affinity DataEC50:  1.14E+3nM. Assay description: Effective concentration for ecdysone-dependent transactivation in mammalian cell line expressing Aedes aegypti ecdysone receptor
In DepthDetails ArticlePubMed