BDBM50128997 CHEMBL3629486
SMILES CCCN(CCC)c1cc(ccc1CNC(=O)C(C)c1ccc(NS(C)(=O)=O)c(F)c1)C(F)(F)F
InChI Key InChIKey=LRTKEBWVNJMBDT-UHFFFAOYSA-N
Data  1 KI
  Tab Delimited (TSV)   2D SDfile   Computed 3D by Vconf -m prep SDfile
Find this compound or compounds like it in BindingDB:
Activity Spreadsheet -- Enzyme Inhibition Constant Data from BindingDB
Found 1 hit for monomerid = 50128997
TargetTransient receptor potential cation channel subfamily V member 1(Homo sapiens (Human))
Seoul National University
Curated by ChEMBL
LigandPNGBDBM50128997(CHEMBL3629486)
Affinity DataKi:  0.300nM. Assay description: Antagonist activity at human TRPV1 heterologously expressed in CHO cells assessed as inhibition of capsaicin-induced activation by FLIPR assay
In DepthDetails ArticlePubMed