BDBM50129106 CHEMBL63122::N-{2-[2-(3-Chloro-4-oxazol-5-yl-phenylamino)-oxazol-5-yl]-phenyl}-2-hydroxy-N-methyl-acetamide
SMILES CN(C(=O)CO)c1ccccc1-c1cnc(Nc2ccc(-c3cnco3)c(Cl)c2)o1
InChI Key InChIKey=UDJQZKOQRHRHER-UHFFFAOYSA-N
Data  1 IC50
  Tab Delimited (TSV)   2D SDfile   Computed 3D by Vconf -m prep SDfile
Find this compound or compounds like it in BindingDB:
Activity Spreadsheet -- Enzyme Inhibition Constant Data from BindingDB
Found 1 hit for monomerid = 50129106
TargetInosine-5'-monophosphate dehydrogenase 2(Homo sapiens (Human))
Bristol-Myers Squibb Pharmaceutical Research Institute
Curated by ChEMBL
LigandPNGBDBM50129106(CHEMBL63122 | N-{2-[2-(3-Chloro-4-oxazol-5-yl-phen...)
Affinity DataIC50:  41nM. Assay description: Inhibition of inosine-5'-monophosphate dehydrogenase 2.
In DepthDetails ArticlePubMed