BDBM50129131 CHEBI:83275::Hypothemycin::US10434085, Compound hypothemycin
SMILES [H][C@@]12C[C@H](O)[C@H](O)C(=O)\C=C/C[C@H](C)OC(=O)c3c(O)cc(OC)cc3[C@@]1([H])O2
InChI Key InChIKey=SSNQAUBBJYCSMY-KNTMUCJRSA-N
Data  5 IC50
PDB links: 1 PDB ID matches this monomer.
  Tab Delimited (TSV)   2D SDfile   Computed 3D by Vconf -m prep SDfile
Find this compound or compounds like it in BindingDB:
Activity Spreadsheet -- Enzyme Inhibition Constant Data from BindingDB
Found 5 hits for monomerid = 50129131
TargetMitogen-activated protein kinase kinase kinase 7(Homo sapiens (Human))
University Of North Carolina At Greensboro
Curated by ChEMBL
LigandPNGBDBM50129131(CHEBI:83275 | Hypothemycin | US10434085, Compound ...)
Affinity DataIC50:  33nM. Assay description: Inhibition of TAK1 (unknown origin)
In DepthDetails ArticlePubMed
TargetMitogen-activated protein kinase kinase kinase 7(Homo sapiens (Human))
University Of North Carolina At Greensboro
Curated by ChEMBL
LigandPNGBDBM50129131(CHEBI:83275 | Hypothemycin | US10434085, Compound ...)
Affinity DataIC50:  33nM. Assay description: The assay was performed at BSP Biosience Inc. (5Z)-7-oxozeaenol was used as a positive control. Analogue 3 was not tested due to the short-term stabi...
In DepthDetails US Patent
TargetNuclear receptor subfamily 2 group C member 2/TGF-beta-activated kinase 1 and MAP3K7-binding protein 1(Homo sapiens (Human))
University Of North Carolina At Greensboro
Curated by ChEMBL
LigandPNGBDBM50129131(CHEBI:83275 | Hypothemycin | US10434085, Compound ...)
Affinity DataIC50:  30nM. Assay description: Inhibition of recombinant human N-terminal GST-tagged TAK1 (1 to 303 residues)/TAB1 (437 to end residues) expressed in baculovirus infected Sf9 insec...
In DepthDetails PubMed
TargetGlycogen synthase kinase-3 beta(Homo sapiens (Human))
Ohio University
Curated by ChEMBL
LigandPNGBDBM50129131(CHEBI:83275 | Hypothemycin | US10434085, Compound ...)
Affinity DataIC50:  663nM. Assay description: Inhibition of human GSK-3beta preincubated for 3 hrs followed by ATP and substrate addition measured by serial dilution assay
In DepthDetails ArticlePubMed
TargetGlycogen synthase kinase-3 beta(Homo sapiens (Human))
Ohio University
Curated by ChEMBL
LigandPNGBDBM50129131(CHEBI:83275 | Hypothemycin | US10434085, Compound ...)
Affinity DataIC50:  1.13E+4nM. Assay description: Inhibition of human GSK-3beta incubated with substrate in presence of ATP measured by serial dilution assay
In DepthDetails ArticlePubMed