BDBM50130082 3-Methyl-2,3,4,5-tetrahydro-1H-[1,4]diazepino[1,7-a]indole::CHEMBL312179
SMILES CN1CCc2cc3ccccc3n2CC1
InChI Key InChIKey=XDQDEBKSCSUIEP-UHFFFAOYSA-N
Data  2 KI
  Tab Delimited (TSV)   2D SDfile   Computed 3D by Vconf -m prep SDfile
Find this compound or compounds like it in BindingDB:
Activity Spreadsheet -- Enzyme Inhibition Constant Data from BindingDB
Found 2 hits for monomerid = 50130082
Target5-hydroxytryptamine receptor 2C(Homo sapiens (Human))
Pharmacia
Curated by ChEMBL
LigandPNGBDBM50130082(3-Methyl-2,3,4,5-tetrahydro-1H-[1,4]diazepino[1,7-...)
Affinity DataKi:  13nM. Assay description: Binding affinity against 5-hydroxytryptamine 2C receptor using [125I]-DOI radioligand.
In DepthDetails ArticlePubMed
Target5-hydroxytryptamine receptor 2A(Homo sapiens (Human))
Pharmacia
Curated by ChEMBL
LigandPNGBDBM50130082(3-Methyl-2,3,4,5-tetrahydro-1H-[1,4]diazepino[1,7-...)
Affinity DataKi:  28nM. Assay description: Binding affinity against 5-hydroxytryptamine 2A receptor using [125I]-DOI radioligand.
In DepthDetails ArticlePubMed