BDBM50130360 2-Methoxy-[1,4]benzoquinone::2-methoxycyclohexa-2,5-diene-1,4-dione::CHEMBL430845
SMILES COC1=CC(=O)C=CC1=O
InChI Key InChIKey=ZJKWJHONFFKJHG-UHFFFAOYSA-N
Data  1 IC50
PDB links: 1 PDB ID matches this monomer.
  Tab Delimited (TSV)   2D SDfile   Computed 3D by Vconf -m prep SDfile
Find this compound or compounds like it in BindingDB:
Activity Spreadsheet -- Enzyme Inhibition Constant Data from BindingDB
Found 1 hit for monomerid = 50130360
TargetReceptor tyrosine-protein kinase erbB-2(Homo sapiens (Human))
Institut FüR Molekulare Physiologie
Curated by ChEMBL
LigandPNGBDBM50130360(2-Methoxy-[1,4]benzoquinone | 2-methoxycyclohexa-2...)
Affinity DataIC50:  2.90E+4nM. Assay description: Inhibition of ERBB2 receptor kinase
In DepthDetails ArticlePubMed