BDBM50130664 CHEMBL3634512::US10329294, Example 149
SMILES Cn1cc(NC(=O)c2cnn3ccc(N[C@@H]4CCCC[C@@H]4N)nc23)c(Cl)n1
InChI Key InChIKey=USPNMMQFVJAHQF-NWDGAFQWSA-N
Data  3 IC50
  Tab Delimited (TSV)   2D SDfile   Computed 3D by Vconf -m prep SDfile
Find this compound or compounds like it in BindingDB:
Activity Spreadsheet -- Enzyme Inhibition Constant Data from BindingDB
Found 3 hits for monomerid = 50130664
TargetInterleukin-1 receptor-associated kinase 4(Homo sapiens (Human))
Merck Research Laboratories
Curated by ChEMBL
LigandPNGBDBM50130664(CHEMBL3634512 | US10329294, Example 149)
Affinity DataIC50:  12nM. Assay description: Inhibition of IRAK4 in human PBMC
In DepthDetails ArticlePubMed
TargetInterleukin-1 receptor-associated kinase 4(Homo sapiens (Human))
Merck Research Laboratories
Curated by ChEMBL
LigandPNGBDBM50130664(CHEMBL3634512 | US10329294, Example 149)
Affinity DataIC50:  0.5nM. Assay description: The kinase activity of IRAK4 is determined by its ability to catalyze the phosphorylation of a fluorescent polypeptide substrate. The extent of phosp...
In DepthDetails US Patent
TargetInterleukin-1 receptor-associated kinase 4(Homo sapiens (Human))
Merck Research Laboratories
Curated by ChEMBL
LigandPNGBDBM50130664(CHEMBL3634512 | US10329294, Example 149)
Affinity DataIC50: <0.5nM. Assay description: Inhibition of IRAK4 (unknown origin)
In DepthDetails ArticlePubMed