BDBM50131348 7-Methoxy-3-[4-((E)-3-phenyl-allyl)-piperazin-1-ylmethyl]-3a,4-dihydro-3H-chromeno[4,3-c]isoxazole::CHEMBL90247
SMILES COc1ccc2C3=NOC(CN4CCN(C\C=C\c5ccccc5)CC4)C3COc2c1
InChI Key InChIKey=WDCPMDKQCCZVEW-VMPITWQZSA-N
Data  4 KI
  Tab Delimited (TSV)   2D SDfile   Computed 3D by Vconf -m prep SDfile
Find this compound or compounds like it in BindingDB:
Activity Spreadsheet -- Enzyme Inhibition Constant Data from BindingDB
Found 4 hits for monomerid = 50131348
TargetAlpha-2A adrenergic receptor(Homo sapiens (Human))
Johnson & Johnson Pharmaceutical Research & Development
Curated by ChEMBL
LigandPNGBDBM50131348(7-Methoxy-3-[4-((E)-3-phenyl-allyl)-piperazin-1-yl...)
Affinity DataKi:  0.5nM. Assay description: In vitro binding affinity towards human alpha-2A adrenergic receptor using [3H]-rauwolscine
In DepthDetails ArticlePubMed
TargetAlpha-2C adrenergic receptor(Homo sapiens (Human))
Johnson & Johnson Pharmaceutical Research & Development
Curated by ChEMBL
LigandPNGBDBM50131348(7-Methoxy-3-[4-((E)-3-phenyl-allyl)-piperazin-1-yl...)
Affinity DataKi:  1.90nM. Assay description: In vitro binding affinity towards human adrenergic alpha-2C adrenergic receptor using [3H]-rauwolscine
In DepthDetails ArticlePubMed
TargetAlpha-2B adrenergic receptor(Homo sapiens (Human))
Johnson & Johnson Pharmaceutical Research & Development
Curated by ChEMBL
LigandPNGBDBM50131348(7-Methoxy-3-[4-((E)-3-phenyl-allyl)-piperazin-1-yl...)
Affinity DataKi:  16nM. Assay description: In vitro binding affinity towards human alpha-2B adrenergic receptor using [3H]-rauwolscine
In DepthDetails ArticlePubMed
TargetSodium-dependent serotonin transporter(Rattus norvegicus (rat))
Johnson & Johnson Pharmaceutical Research & Development
Curated by ChEMBL
LigandPNGBDBM50131348(7-Methoxy-3-[4-((E)-3-phenyl-allyl)-piperazin-1-yl...)
Affinity DataKi:  19nM. Assay description: In vitro binding affinity towards rat serotonin transporter
In DepthDetails ArticlePubMed