BDBM50131780 (1-Benzhydryl-2-{2-[(5-carbamimidoyl-thiophen-2-ylmethyl)-carbamoyl]-pyrrolidin-1-yl}-2-oxo-ethylamino)-acetic acid::CHEMBL420540
SMILES NC(=N)c1ccc(CNC(=O)[C@@H]2CCCN2C(=O)[C@H](NCC(O)=O)C(c2ccccc2)c2ccccc2)s1
InChI Key InChIKey=BIHPYGVYKSQDLA-SQJMNOBHSA-N
Data  6 KI
  Tab Delimited (TSV)   2D SDfile   Computed 3D by Vconf -m prep SDfile
Find this compound or compounds like it in BindingDB:
Activity Spreadsheet -- Enzyme Inhibition Constant Data from BindingDB
Found 6 hits for monomerid = 50131780
TargetProthrombin(Homo sapiens (Human))
Lg Life Sciences
Curated by ChEMBL
LigandPNGBDBM50131780((1-Benzhydryl-2-{2-[(5-carbamimidoyl-thiophen-2-yl...)
Affinity DataKi:  0.0150nM. Assay description: In vitro inhibition constant (Ki) against human thrombin
In DepthDetails ArticlePubMed
TargetSerine protease 1/Trypsin-2(Homo sapiens (Human))
Lg Life Sciences
Curated by ChEMBL
LigandPNGBDBM50131780((1-Benzhydryl-2-{2-[(5-carbamimidoyl-thiophen-2-yl...)
Affinity DataKi:  0.300nM. Assay description: In vitro inhibition constant (Ki) against human human trypsin was determined
In DepthDetails ArticlePubMed
TargetSerine protease 1(Bos taurus (bovine))
Lg Life Sciences
Curated by ChEMBL
LigandPNGBDBM50131780((1-Benzhydryl-2-{2-[(5-carbamimidoyl-thiophen-2-yl...)
Affinity DataKi:  3nM. Assay description: In vitro inhibition constant (Ki) against human bovine trypsin was determined
In DepthDetails ArticlePubMed
TargetCoagulation factor X(Homo sapiens (Human))
Lg Life Sciences
Curated by ChEMBL
LigandPNGBDBM50131780((1-Benzhydryl-2-{2-[(5-carbamimidoyl-thiophen-2-yl...)
Affinity DataKi:  22.5nM. Assay description: In vitro inhibition constant (Ki) against human Coagulation factor X was determined
In DepthDetails ArticlePubMed
TargetTissue-type plasminogen activator(Homo sapiens (Human))
Lg Life Sciences
Curated by ChEMBL
LigandPNGBDBM50131780((1-Benzhydryl-2-{2-[(5-carbamimidoyl-thiophen-2-yl...)
Affinity DataKi:  433nM. Assay description: In vitro inhibition constant (Ki) against human Tissue type plasminogen activator was determined
In DepthDetails ArticlePubMed
TargetPlasminogen(Homo sapiens (Human))
Lg Life Sciences
Curated by ChEMBL
LigandPNGBDBM50131780((1-Benzhydryl-2-{2-[(5-carbamimidoyl-thiophen-2-yl...)
Affinity DataKi:  7.40E+3nM. Assay description: In vitro inhibition constant (Ki) against human human plasmin was determined
In DepthDetails ArticlePubMed