BDBM50131796 (1-Benzhydryl-2-{2-[(5-carbamimidoyl-thiophen-2-ylmethyl)-carbamoyl]-pyrrolidin-1-yl}-2-oxo-ethyl)-carbamic acid methyl ester::CHEMBL119877
SMILES COC(=O)N[C@H](C(c1ccccc1)c1ccccc1)C(=O)N1CCC[C@H]1C(=O)NCc1ccc(s1)C(N)=N
InChI Key InChIKey=CYNABVDJWVHYLL-XUZZJYLKSA-N
Data  1 KI
  Tab Delimited (TSV)   2D SDfile   Computed 3D by Vconf -m prep SDfile
Find this compound or compounds like it in BindingDB:
Activity Spreadsheet -- Enzyme Inhibition Constant Data from BindingDB
Found 1 hit for monomerid = 50131796
TargetProthrombin(Homo sapiens (Human))
Lg Life Sciences
Curated by ChEMBL
LigandPNGBDBM50131796((1-Benzhydryl-2-{2-[(5-carbamimidoyl-thiophen-2-yl...)
Affinity DataKi:  0.0150nM. Assay description: In vitro inhibition constant (Ki) against human thrombin
In DepthDetails ArticlePubMed