BDBM50131797 1-(2-sulfonamide-amino-3,3-diphenyl-propionyl)-pyrrolidine-2-carboxylic acid (5-carbamimidoyl-thiophen-3-ylmethyl)-amide::CHEMBL332764
SMILES NC(=N)c1cc(CNC(=O)[C@@H]2CCCN2C(=O)[C@H](NS(N)(=O)=O)C(c2ccccc2)c2ccccc2)cs1
InChI Key InChIKey=IYSZPZTWYCFAOQ-NZQKXSOJSA-N
Data  1 KI
  Tab Delimited (TSV)   2D SDfile   Computed 3D by Vconf -m prep SDfile
Find this compound or compounds like it in BindingDB:
Activity Spreadsheet -- Enzyme Inhibition Constant Data from BindingDB
Found 1 hit for monomerid = 50131797
TargetProthrombin(Homo sapiens (Human))
Lg Life Sciences
Curated by ChEMBL
LigandPNGBDBM50131797(1-(2-sulfonamide-amino-3,3-diphenyl-propionyl)-pyr...)
Affinity DataKi:  0.160nM. Assay description: In vitro inhibition constant (Ki) against human thrombin
In DepthDetails ArticlePubMed