BDBM50133978 (3S,3aR,6aS)-1-Cyclopropanecarbonyl-3-methyl-4-[(S)-1-(4'-propoxy-biphenyl-4-sulfonyl)-pyrrolidine-2-carbonyl]-hexahydro-pyrrolo[3,2-b]pyrrol-2-one::CHEMBL137649
SMILES CCCOc1ccc(cc1)-c1ccc(cc1)S(=O)(=O)N1CCC[C@H]1C(=O)N1CC[C@H]2[C@H]1[C@H](C)C(=O)N2C(=O)C1CC1
InChI Key InChIKey=QLJQMSRXDYZKHQ-QGQKXLEHSA-N
Data  1 KI
  Tab Delimited (TSV)   2D SDfile   Computed 3D by Vconf -m prep SDfile
Find this compound or compounds like it in BindingDB:
Activity Spreadsheet -- Enzyme Inhibition Constant Data from BindingDB
Found 1 hit for monomerid = 50133978
TargetCapsid scaffolding protein(Human cytomegalovirus (strain AD169) (HHV-5) (Huma...)
Glaxosmithkline
Curated by ChEMBL
LigandPNGBDBM50133978((3S,3aR,6aS)-1-Cyclopropanecarbonyl-3-methyl-4-[(S...)
Affinity DataKi:  33nM. Assay description: Potency against human cytomegalovirus protease in HCMV pNA assay
In DepthDetails ArticlePubMed