BDBM50134193 CHEMBL3735461
SMILES N[C@H]1C[C@H](CO[C@@H]1c1cc(F)ccc1F)N1Cc2[nH]nc(NS(=O)(=O)CC(F)(F)F)c2C1
InChI Key InChIKey=NDTBETBUNMGIEA-FUEDEBDSSA-N
Data  1 IC50
  Tab Delimited (TSV)   2D SDfile   Computed 3D by Vconf -m prep SDfile
Find this compound or compounds like it in BindingDB:
Activity Spreadsheet -- Enzyme Inhibition Constant Data from BindingDB
Found 1 hit for monomerid = 50134193
TargetDipeptidyl peptidase 4(Homo sapiens (Human))
Merck Research Laboratories
Curated by ChEMBL
LigandPNGBDBM50134193(CHEMBL3735461)
Affinity DataIC50:  1.30nM. Assay description: Inhibition of recombinant human DPP4 expressed in Sf9 cells using Gly-Pro-AMC substrate after 30 mins by plate reader analysis
In DepthDetails ArticlePubMed