BDBM50134956 CHEMBL441760::H-Tyr-Val-c[Cys-Gly-His-Phe-Arg-Trp-Pen]-Arg-Phe-Gly-NH2
SMILES CC(C)[C@H](NC(=O)[C@@H](N)Cc1ccc(O)cc1)C(=O)N[C@@H]1CSSC(C)(C)[C@H](NC(=O)[C@H](Cc2c[nH]c3ccccc23)NC(=O)[C@H](CCCNC(N)=N)NC(=O)[C@@H](Cc2ccccc2)NC(=O)[C@H](Cc2cnc[nH]2)NC(=O)CNC1=O)C(=O)N[C@@H](CCCNC(N)=N)C(=O)N[C@@H](Cc1ccccc1)C(=O)NCC(N)=O
InChI Key InChIKey=DBQMOWPZVCVWBP-CBWRAPNLSA-N
Data  3 KI  3 EC50
  Tab Delimited (TSV)   2D SDfile   Computed 3D by Vconf -m prep SDfile
Find this compound or compounds like it in BindingDB:
Activity Spreadsheet -- Enzyme Inhibition Constant Data from BindingDB
Found 6 hits for monomerid = 50134956
TargetMelanocortin receptor 3(Homo sapiens (Human))
University Of Arizona
Curated by ChEMBL
LigandPNGBDBM50134956(CHEMBL441760 | H-Tyr-Val-c[Cys-Gly-His-Phe-Arg-Trp...)
Affinity DataKi:  480nM. Assay description: Binding affinity against human Melanocortin 3 receptor by gamma-MCH displacement.
In DepthDetails ArticlePubMed
TargetMelanocortin receptor 5(Homo sapiens (Human))
University Of Arizona
Curated by ChEMBL
LigandPNGBDBM50134956(CHEMBL441760 | H-Tyr-Val-c[Cys-Gly-His-Phe-Arg-Trp...)
Affinity DataKi:  480nM. Assay description: Binding affinity against human Melanocortin 5 receptor by gamma-MCH displacement.
In DepthDetails ArticlePubMed
TargetMelanocortin receptor 4(Homo sapiens (Human))
University Of Arizona
Curated by ChEMBL
LigandPNGBDBM50134956(CHEMBL441760 | H-Tyr-Val-c[Cys-Gly-His-Phe-Arg-Trp...)
Affinity DataKi: >1.00E+4nM. Assay description: Binding affinity against Melanocortin 4 receptor by gamma-MCH displacement.
In DepthDetails ArticlePubMed
TargetMelanocortin receptor 5(Homo sapiens (Human))
University Of Arizona
Curated by ChEMBL
LigandPNGBDBM50134956(CHEMBL441760 | H-Tyr-Val-c[Cys-Gly-His-Phe-Arg-Trp...)
Affinity DataEC50: >1.00E+4nM. Assay description: Intracellular cAMP accumulation in human Melanocortin 5 receptor functional assay.
In DepthDetails ArticlePubMed
TargetMelanocortin receptor 3(Homo sapiens (Human))
University Of Arizona
Curated by ChEMBL
LigandPNGBDBM50134956(CHEMBL441760 | H-Tyr-Val-c[Cys-Gly-His-Phe-Arg-Trp...)
Affinity DataEC50: >1.00E+4nM. Assay description: Intracellular cAMP accumulation in human Melanocortin 3 receptor functional assay.
In DepthDetails ArticlePubMed
TargetMelanocortin receptor 4(Homo sapiens (Human))
University Of Arizona
Curated by ChEMBL
LigandPNGBDBM50134956(CHEMBL441760 | H-Tyr-Val-c[Cys-Gly-His-Phe-Arg-Trp...)
Affinity DataEC50: >1.00E+4nM. Assay description: Intracellular cAMP accumulation in Melanocortin 4 receptor functional assay.
In DepthDetails ArticlePubMed