BDBM50135619 CHEMBL317383::N-(2-Diethylamino-ethyl)-3-[3-methyl-5-sulfamoyl-3H-[1,3,4]thiadiazol-(2E)-ylidenesulfamoyl]-benzamide
SMILES CCN(CC)CCNC(=O)c1cccc(c1)S(=O)(=O)\N=c1\sc(nn1C)S(N)(=O)=O
InChI Key InChIKey=MIQBEZQTOUCHMZ-HMMYKYKNSA-N
Data  3 KI
  Tab Delimited (TSV)   2D SDfile   Computed 3D by Vconf -m prep SDfile
Find this compound or compounds like it in BindingDB:
Activity Spreadsheet -- Enzyme Inhibition Constant Data from BindingDB
Found 3 hits for monomerid = 50135619
TargetCarbonic anhydrase 2(Homo sapiens (Human))
Universit£
Curated by ChEMBL
LigandPNGBDBM50135619(CHEMBL317383 | N-(2-Diethylamino-ethyl)-3-[3-methy...)
Affinity DataKi:  1.90nM. Assay description: Inhibitory activity against human carbonic anhydrase II
In DepthDetails ArticlePubMed
TargetCarbonic anhydrase 4(Bos taurus (bovine))
Universit£
Curated by ChEMBL
LigandPNGBDBM50135619(CHEMBL317383 | N-(2-Diethylamino-ethyl)-3-[3-methy...)
Affinity DataKi:  7nM. Assay description: Inhibitory activity against Carbonic anhydrase IV isolated from bovine lung
In DepthDetails ArticlePubMed
TargetCarbonic anhydrase 1(Homo sapiens (Human))
Universit£
Curated by ChEMBL
LigandPNGBDBM50135619(CHEMBL317383 | N-(2-Diethylamino-ethyl)-3-[3-methy...)
Affinity DataKi:  16nM. Assay description: Inhibitory activity against human carbonic anhydrase I (hCA I)
In DepthDetails ArticlePubMed