BDBM50138095 (2-{2-[4-(7-Hydroxy-heptyl)-3-oxo-3,4-dihydro-2H-benzo[1,4]oxazin-2-yl]-ethoxy}-phenyl)-acetic acid::CHEMBL175589
SMILES OCCCCCCCN1C(=O)C(CCOc2ccccc2CC(O)=O)Oc2ccccc12
InChI Key InChIKey=UPYPBDPTACIYLQ-UHFFFAOYSA-N
Data  1 EC50
  Tab Delimited (TSV)   2D SDfile   Computed 3D by Vconf -m prep SDfile
Find this compound or compounds like it in BindingDB:
Activity Spreadsheet -- Enzyme Inhibition Constant Data from BindingDB
Found 1 hit for monomerid = 50138095
TargetPeroxisome proliferator-activated receptor gamma(Homo sapiens (Human))
Johnson And Johnson Pharmaceutical Research And Development
Curated by ChEMBL
LigandPNGBDBM50138095((2-{2-[4-(7-Hydroxy-heptyl)-3-oxo-3,4-dihydro-2H-b...)
Affinity DataEC50:  149nM. Assay description: Agonistic activity against PPAR (peroxisome proliferator activated receptor gamma) in Suarus chinesis
In DepthDetails ArticlePubMed