BDBM50138283 CHEMBL3754672
SMILES C(CCCNc1c2CCCCCc2nc2ccccc12)CCCN(Cc1cc2ccccc2o1)Cc1cc2ccccc2o1
InChI Key InChIKey=OSNBHPQSXCZVRH-UHFFFAOYSA-N
Data  2 IC50
  Tab Delimited (TSV)   2D SDfile   Computed 3D by Vconf -m prep SDfile
Find this compound or compounds like it in BindingDB:
Activity Spreadsheet -- Enzyme Inhibition Constant Data from BindingDB
Found 2 hits for monomerid = 50138283
TargetCholinesterase(Homo sapiens (Human))
China Pharmaceutical University
Curated by ChEMBL
LigandPNGBDBM50138283(CHEMBL3754672)
Affinity DataIC50:  18nM. Assay description: Inhibition of human serum BChE using butyrylthiocholine iodide as substrate preincubated for 20 mins followed by substrate addition by Ellman's metho...
In DepthDetails ArticlePubMed
TargetAcetylcholinesterase(Homo sapiens (Human))
China Pharmaceutical University
Curated by ChEMBL
LigandPNGBDBM50138283(CHEMBL3754672)
Affinity DataIC50:  200nM. Assay description: Inhibition of recombinant human AChE using acetylthiocholine iodide as substrate preincubated for 20 mins followed by substrate addition by Ellman's ...
In DepthDetails ArticlePubMed