BDBM50138497 CHEMBL3754500
SMILES O=C(Nc1nc(nc2cn(nc12)-c1ccccc1)-c1ccccc1)c1cccs1
InChI Key InChIKey=VCQDZBBQNJKXHR-UHFFFAOYSA-N
Data  1 KI  1 IC50
  Tab Delimited (TSV)   2D SDfile   Computed 3D by Vconf -m prep SDfile
Find this compound or compounds like it in BindingDB:
Activity Spreadsheet -- Enzyme Inhibition Constant Data from BindingDB
Found 2 hits for monomerid = 50138497
TargetAdenosine receptor A3(Homo sapiens (Human))
Universit£
Curated by ChEMBL
LigandPNGBDBM50138497(CHEMBL3754500)
Affinity DataKi:  5.90nM. Assay description: Displacement of [125I]AB-MECA at human A3A receptor expressed in CHO cell membrane after 60 mins by scintillation counting method
In DepthDetails ArticlePubMed
TargetAdenosine receptor A3(Homo sapiens (Human))
Universit£
Curated by ChEMBL
LigandPNGBDBM50138497(CHEMBL3754500)
Affinity DataIC50:  13nM. Assay description: Antagonist activity at human A3 receptor expressed in CHO cells assessed as inhibition of Cl-IB-MECA-induced cAMP production by scintillation countin...
In DepthDetails ArticlePubMed