BDBM50138849 CHEMBL157224::[(S)-1-(2-Isopropyl-2H-pyrazol-3-ylaminooxalyl)-pentyl]-carbamic acid 1-isopropyl-2-methyl-propyl ester
SMILES CCCC[C@H](NC(=O)OC(C(C)C)C(C)C)C(=O)C(=O)Nc1ccnn1C(C)C
InChI Key InChIKey=KRSRTEWWJDPHRT-INIZCTEOSA-N
Data  2 IC50
  Tab Delimited (TSV)   2D SDfile   Computed 3D by Vconf -m prep SDfile
Find this compound or compounds like it in BindingDB:
Activity Spreadsheet -- Enzyme Inhibition Constant Data from BindingDB
Found 2 hits for monomerid = 50138849
TargetCathepsin K(Homo sapiens (Human))
Glaxosmithkline
Curated by ChEMBL
LigandPNGBDBM50138849(CHEMBL157224 | [(S)-1-(2-Isopropyl-2H-pyrazol-3-yl...)
Affinity DataIC50:  17nM. Assay description: Concentration required to inhibit 50% of cysteine protease cathepsin K of human
In DepthDetails ArticlePubMed
TargetCathepsin K(Rattus norvegicus)
Glaxosmithkline
Curated by ChEMBL
LigandPNGBDBM50138849(CHEMBL157224 | [(S)-1-(2-Isopropyl-2H-pyrazol-3-yl...)
Affinity DataIC50:  1.00E+3nM. Assay description: Inhibition of cystiene protease cathepsin K of rat
In DepthDetails ArticlePubMed