BDBM50138857 CHEMBL347137::[(S)-2-Methyl-1-(thiophen-2-ylmethyl)-aminooxalyl]-butyl)-carbamic acid 1-isopropyl-2-methyl-propyl ester
SMILES CCC(C)[C@H](NC(=O)OC(C(C)C)C(C)C)C(=O)C(=O)NCc1cccs1
InChI Key InChIKey=SWZJKCMMNAVMHD-WMCAAGNKSA-N
Data  1 IC50
  Tab Delimited (TSV)   2D SDfile   Computed 3D by Vconf -m prep SDfile
Find this compound or compounds like it in BindingDB:
Activity Spreadsheet -- Enzyme Inhibition Constant Data from BindingDB
Found 1 hit for monomerid = 50138857
TargetCathepsin K(Homo sapiens (Human))
Glaxosmithkline
Curated by ChEMBL
LigandPNGBDBM50138857(CHEMBL347137 | [(S)-2-Methyl-1-(thiophen-2-ylmethy...)
Affinity DataIC50:  87nM. Assay description: Concentration required to inhibit 50% of cysteine protease cathepsin K of human
In DepthDetails ArticlePubMed