BDBM50138878 CHEMBL422686::[(S)-1-(Thiophen-2-ylmethyl)-aminooxalyl]-pentyl)-carbamic acid 1-isopropyl-2-methyl-propyl ester
SMILES CCCC[C@H](NC(=O)OC(C(C)C)C(C)C)C(=O)C(=O)NCc1cccs1
InChI Key InChIKey=LSAGAYCJHAMUPG-INIZCTEOSA-N
Data  1 IC50
  Tab Delimited (TSV)   2D SDfile   Computed 3D by Vconf -m prep SDfile
Find this compound or compounds like it in BindingDB:
Activity Spreadsheet -- Enzyme Inhibition Constant Data from BindingDB
Found 1 hit for monomerid = 50138878
TargetCathepsin K(Homo sapiens (Human))
Glaxosmithkline
Curated by ChEMBL
LigandPNGBDBM50138878(CHEMBL422686 | [(S)-1-(Thiophen-2-ylmethyl)-aminoo...)
Affinity DataIC50:  9.20nM. Assay description: Concentration required to inhibit 50% of cysteine protease cathepsin K of human
In DepthDetails ArticlePubMed