BDBM50139088 (S)-2-[((R)-2-Benzenesulfonyl-2-aza-bicyclo[2.2.2]octane-3-carbonyl)-amino]-3-[4-(2,6-dichloro-benzoylamino)-phenyl]-propionic acid::CHEMBL345373
SMILES OC(=O)[C@H](Cc1ccc(NC(=O)c2c(Cl)cccc2Cl)cc1)NC(=O)[C@H]1C2CCC(CC2)N1S(=O)(=O)c1ccccc1
InChI Key InChIKey=MBWMZHLHDZJOJJ-JAPWCCBJSA-N
Data  1 IC50
  Tab Delimited (TSV)   2D SDfile   Computed 3D by Vconf -m prep SDfile
Find this compound or compounds like it in BindingDB:
Activity Spreadsheet -- Enzyme Inhibition Constant Data from BindingDB
Found 1 hit for monomerid = 50139088
TargetIntegrin alpha-4/beta-1(Homo sapiens (Human))
Johnson & Johnson Pharmaceutical Research & Development
Curated by ChEMBL
LigandPNGBDBM50139088((S)-2-[((R)-2-Benzenesulfonyl-2-aza-bicyclo[2.2.2]...)
Affinity DataIC50:  1.60E+3nM. Assay description: In vitro inhibition of binding of integrin alpha4-beta1 to immobilized VCAM-1 expressed on endothelial cell surface.
In DepthDetails ArticlePubMed