BDBM50140274 CHEMBL3753665
SMILES CCOc1cc(cnc1N)-c1ccc2nc(NC(C)=O)cn2c1
InChI Key InChIKey=JBFQQGQNUUSZHR-UHFFFAOYSA-N
Data  1 IC50  1 EC50
  Tab Delimited (TSV)   2D SDfile   Computed 3D by Vconf -m prep SDfile
Find this compound or compounds like it in BindingDB:
Activity Spreadsheet -- Enzyme Inhibition Constant Data from BindingDB
Found 2 hits for monomerid = 50140274
TargetPhosphatidylinositol 4,5-bisphosphate 3-kinase catalytic subunit alpha isoform(Homo sapiens (Human))
Novartis Institutes For Biomedical Research
Curated by ChEMBL
LigandPNGBDBM50140274(CHEMBL3753665)
Affinity DataIC50:  16nM. Assay description: Inhibition of PI3Kalpha (unknown origin) using 1 alpha-phosphatidylinositol as substrate assessed as ATP depletion after 5 mins by KinaseGlo assay
In DepthDetails ArticlePubMed
TargetPhosphatidylinositol 4,5-bisphosphate 3-kinase catalytic subunit alpha isoform(Homo sapiens (Human))
Novartis Institutes For Biomedical Research
Curated by ChEMBL
LigandPNGBDBM50140274(CHEMBL3753665)
Affinity DataEC50:  270nM. Assay description: Inhibition of PI3Kalpha in human A2780 cells assessed as reduction of AKT phosphorylation at Ser473 after 1 hr
In DepthDetails ArticlePubMed