BDBM50141914 (2R,4S)-2-[(2S,3S)-3-{4-[5-(3,4-Dimethoxy-benzyl)-2-ethyl-2H-pyrazol-3-yl]-piperidin-1-ylmethyl}-4-(3-fluoro-phenyl)-pyrrolidin-1-yl]-3-methyl-pentanoic acid::CHEMBL172090
SMILES CC[C@H](C)[C@@H](N1C[C@H](CN2CCC(CC2)c2cc(Cc3ccc(OC)c(OC)c3)nn2CC)[C@H](C1)c1cccc(F)c1)C(O)=O
InChI Key InChIKey=RJVRDLDDCGQDGE-GTRCSXEUSA-N
Data  1 KI  1 IC50
  Tab Delimited (TSV)   2D SDfile   Computed 3D by Vconf -m prep SDfile
Find this compound or compounds like it in BindingDB:
Activity Spreadsheet -- Enzyme Inhibition Constant Data from BindingDB
Found 2 hits for monomerid = 50141914
TargetPotassium voltage-gated channel subfamily H member 2(Homo sapiens (Human))
Merck Research Laboratories
Curated by ChEMBL
LigandPNGBDBM50141914((2R,4S)-2-[(2S,3S)-3-{4-[5-(3,4-Dimethoxy-benzyl)-...)
Affinity DataKi:  2.20E+4nM. Assay description: Binding affinity against hERG Voltage-gated potassium channel subunit Kv11.1
In DepthDetails ArticlePubMed
TargetC-C chemokine receptor type 5(Homo sapiens (Human))
Merck Research Laboratories
Curated by ChEMBL
LigandPNGBDBM50141914((2R,4S)-2-[(2S,3S)-3-{4-[5-(3,4-Dimethoxy-benzyl)-...)
Affinity DataIC50:  1.5nM. Assay description: Inhibitory concentration for displacement of [125I]-MIP-1 alpha from recombinant human CC chemokine receptor 5 (CCR5) expressed in CHO cell
In DepthDetails ArticlePubMed