BDBM50142577 11-(4-Chloro-phenyl)-9-(4-methyl-thiazol-2-yl)-6,7-dihydro-5H-2,7a-diaza-dibenzo[a,c]cyclohepten-8-one::CHEMBL295027
SMILES Cc1csc(n1)-c1cc(-c2ccc(Cl)cc2)c2-c3cnccc3CCCn2c1=O
InChI Key InChIKey=YIGPWWJHDOXRHC-UHFFFAOYSA-N
Data  2 KI
  Tab Delimited (TSV)   2D SDfile   Computed 3D by Vconf -m prep SDfile
Find this compound or compounds like it in BindingDB:
Activity Spreadsheet -- Enzyme Inhibition Constant Data from BindingDB
Found 2 hits for monomerid = 50142577
TargetGamma-aminobutyric acid receptor subunit alpha-1/beta-3/gamma-2(Homo sapiens (Human))
The Neuroscience Research Centre
Curated by ChEMBL
LigandPNGBDBM50142577(11-(4-Chloro-phenyl)-9-(4-methyl-thiazol-2-yl)-6,7...)
Affinity DataKi:  0.200nM. Assay description: Binding affinity at human recombinant gamma-aminobutyric-acid A receptor alpha3-beta3-gamma2 expressed in L(tk) cells by [3H]-Ro-15-1788 displacement...
In DepthDetails ArticlePubMed
TargetGamma-aminobutyric acid receptor subunit alpha-3/beta-3/gamma-2(Homo sapiens (Human))
The Neuroscience Research Centre
Curated by ChEMBL
LigandPNGBDBM50142577(11-(4-Chloro-phenyl)-9-(4-methyl-thiazol-2-yl)-6,7...)
Affinity DataKi:  0.400nM. Assay description: Binding affinity at human recombinant gamma-aminobutyric-acid A receptor alpha1-beta3-gamma2 expressed in L(tk) cells by [3H]-Ro-15-1788 displacement...
In DepthDetails ArticlePubMed