BDBM50143914 (3-Cyclohexyl-ureido)-acetic acid::2-(3-cyclohexylureido)acetic acid::CHEMBL66380::N-[(CYCLOHEXYLAMINO)CARBONYL]GLYCINE
SMILES OC(=O)CNC(=O)NC1CCCCC1
InChI Key InChIKey=NVORCMBCUHQRDL-UHFFFAOYSA-N
Data  4 IC50
PDB links: 2 PDB IDs match this monomer.
  Tab Delimited (TSV)   2D SDfile   Computed 3D by Vconf -m prep SDfile
Find this compound or compounds like it in BindingDB:
Activity Spreadsheet -- Enzyme Inhibition Constant Data from BindingDB
Found 4 hits for monomerid = 50143914
TargetBifunctional epoxide hydrolase 2(Mus musculus (Mouse))
University Of California Davis
Curated by ChEMBL
LigandPNGBDBM50143914((3-Cyclohexyl-ureido)-acetic acid | 2-(3-cyclohexy...)
Affinity DataIC50: >5.00E+5nM. Assay description: Tested for 50 % inhibitory concentration against mouse soluble epoxide hydrolase (sEH)
In DepthDetails ArticlePubMed
TargetBifunctional epoxide hydrolase 2(Homo sapiens (Human))
University Of California
Curated by ChEMBL
LigandPNGBDBM50143914((3-Cyclohexyl-ureido)-acetic acid | 2-(3-cyclohexy...)
Affinity DataIC50: >1.00E+5nM. Assay description: Inhibition of human recombinant soluble Epoxide hydrolase
TargetBifunctional epoxide hydrolase 2(Mus musculus (Mouse))
University Of California Davis
Curated by ChEMBL
LigandPNGBDBM50143914((3-Cyclohexyl-ureido)-acetic acid | 2-(3-cyclohexy...)
Affinity DataIC50: >1.00E+5nM. Assay description: Inhibition of mouse recombinant soluble Epoxide hydrolase
In DepthDetails ArticlePubMed
TargetBifunctional epoxide hydrolase 2(Homo sapiens (Human))
University Of California
Curated by ChEMBL
LigandPNGBDBM50143914((3-Cyclohexyl-ureido)-acetic acid | 2-(3-cyclohexy...)
Affinity DataIC50: >5.00E+5nM. Assay description: Tested for 50 % inhibitory concentration against human soluble epoxide hydrolase (sEH)