BDBM50145425 1-(2-chloro-2-phenylethyl)-6-(ethylthio)-N-propyl-1H-pyrazolo[3,4-d]pyrimidin-4-amine::CHEMBL84020::[1-(2-Chloro-2-phenyl-ethyl)-6-ethylsulfanyl-1H-pyrazolo[3,4-d]pyrimidin-4-yl]-propyl-amine
SMILES CCCNc1nc(SCC)nc2n(CC(Cl)c3ccccc3)ncc12
InChI Key InChIKey=GQEBJZBXGMJVOU-UHFFFAOYSA-N
Data  2 KI
  Tab Delimited (TSV)   2D SDfile   Computed 3D by Vconf -m prep SDfile
Find this compound or compounds like it in BindingDB:
Activity Spreadsheet -- Enzyme Inhibition Constant Data from BindingDB
Found 2 hits for monomerid = 50145425
TargetProto-oncogene tyrosine-protein kinase Src(Homo sapiens (Human))
Universit£
Curated by ChEMBL
LigandPNGBDBM50145425(1-(2-chloro-2-phenylethyl)-6-(ethylthio)-N-propyl-...)
Affinity DataKi:  631nM. Assay description: Inhibition of c-Src
In DepthDetails ArticlePubMed
TargetProto-oncogene tyrosine-protein kinase Src(Homo sapiens (Human))
Universit£
Curated by ChEMBL
LigandPNGBDBM50145425(1-(2-chloro-2-phenylethyl)-6-(ethylthio)-N-propyl-...)
Affinity DataKi:  700nM. Assay description: Inhibitory activity against Src in cell free assay
In DepthDetails ArticlePubMed