BDBM50145608 CHEMBL3763558
SMILES Clc1ccc(cc1Cl)N1CCN(CCCNC(=O)c2ccncc2)CC1
InChI Key InChIKey=QEVIFCJESGLVMY-UHFFFAOYSA-N
Data  3 KI  1 IC50
  Tab Delimited (TSV)   2D SDfile   Computed 3D by Vconf -m prep SDfile
Find this compound or compounds like it in BindingDB:
Activity Spreadsheet -- Enzyme Inhibition Constant Data from BindingDB
Found 4 hits for monomerid = 50145608
Target5-hydroxytryptamine receptor 2A(Rattus norvegicus (rat))
Dipartimento Di Farmacia Universit£
Curated by ChEMBL
LigandPNGBDBM50145608(CHEMBL3763558)
Affinity DataKi:  1.10nM. Assay description: Displacement of [3H]ketanserin from 5HT2A receptor in Sprague-Dawley rat brain cortex incubated for 15 mins by liquid scintillation counting analysis
In DepthDetails ArticlePubMed
Target5-hydroxytryptamine receptor 1A(Rattus norvegicus (rat))
Dipartimento Di Farmacia Universit£
Curated by ChEMBL
LigandPNGBDBM50145608(CHEMBL3763558)
Affinity DataKi:  219nM. Assay description: Displacement of [3H]8-OH-DPAT from 5HT1A receptor in Sprague-Dawley rat brain cortex incubated for 30 mins by liquid scintillation counting analysis
In DepthDetails ArticlePubMed
Target5-hydroxytryptamine receptor 2C(Rattus norvegicus (Rat))
Dipartimento Di Farmacia Universit£
Curated by ChEMBL
LigandPNGBDBM50145608(CHEMBL3763558)
Affinity DataKi: >1.00E+4nM. Assay description: Displacement of [3H]mesulergine from 5HT2C receptor in Sprague-Dawley rat brain cortex incubated for 15 mins by liquid scintillation counting analysi...
In DepthDetails ArticlePubMed
Target5-hydroxytryptamine receptor 2A(Rattus norvegicus (rat))
Dipartimento Di Farmacia Universit£
Curated by ChEMBL
LigandPNGBDBM50145608(CHEMBL3763558)
Affinity DataIC50:  12.2nM. Assay description: Antagonist activity at 5HT2A receptor in Sprague-Dawley rat ileum assessed as inhibition of 5-HT-induced contraction
In DepthDetails ArticlePubMed